Reaction Details
TargetNociceptin receptor
LigandBDBM50210245
Substrate/Competitorn/a
Meas. Tech.ChEMBL_443964 (CHEMBL892111)
Ki 1.8±n/a nM
Citation Ho, GDBercovici, ATulshian, DGreenlee, WJFawzi, AFernandez, XMcLeod, RLSmith Torhan, AZhang, H Synthesis and structure-activity relationships of 4-hydroxy-4-phenylpiperidines as nociceptin receptor ligands: Part 2. Bioorg Med Chem Lett17:3028-33 (2007) 
 
Nociceptin receptor
Name:Nociceptin receptor
Type:G Protein-Coupled Receptor (GPCR)
Mol. Mass.:40702.87
Organism:Homo sapiens (Human)
Description:P41146
Residue:370
BDBM50210245
NameBDBM50210245
Synonyms:4-(2-(aminomethyl)phenyl)-1-(bis(2-bromophenyl)methyl)piperidin-4-ol | CHEMBL233956
TypeSmall organic molecule
Emp. Form.C25H26Br2N2O
Mol. Mass.530.295
SMILESNCc1ccccc1C1(O)CCN(CC1)C(c1ccccc1Br)c1ccccc1Br