Reaction Details
TargetMu-type opioid receptor
LigandBDBM50210247
Substrate/Competitorn/a
Meas. Tech.ChEMBL_443967 (CHEMBL892114)
Ki 2±n/a nM
Citation Ho, GDBercovici, ATulshian, DGreenlee, WJFawzi, AFernandez, XMcLeod, RLSmith Torhan, AZhang, H Synthesis and structure-activity relationships of 4-hydroxy-4-phenylpiperidines as nociceptin receptor ligands: Part 2. Bioorg Med Chem Lett17:3028-33 (2007) 
 
Mu-type opioid receptor
Name:Mu-type opioid receptor
Type:G Protein-Coupled Receptor (GPCR)
Mol. Mass.:44789.51
Organism:Homo sapiens (Human)
Description:P35372
Residue:400
BDBM50210247
NameBDBM50210247
Synonyms:4-(2-(aminomethyl)phenyl)-1-(1-phenylhexyl)piperidin-4-ol | CHEMBL441914
TypeSmall organic molecule
Emp. Form.C24H34N2O
Mol. Mass.366.5396
SMILESCCCCCC(N1CCC(O)(CC1)c1ccccc1CN)c1ccccc1