Reaction Details
TargetNociceptin receptor
LigandBDBM50210231
Substrate/Competitorn/a
Meas. Tech.ChEMBL_443964 (CHEMBL892111)
Ki 15±n/a nM
Citation Ho, GDBercovici, ATulshian, DGreenlee, WJFawzi, AFernandez, XMcLeod, RLSmith Torhan, AZhang, H Synthesis and structure-activity relationships of 4-hydroxy-4-phenylpiperidines as nociceptin receptor ligands: Part 2. Bioorg Med Chem Lett17:3028-33 (2007) 
 
Nociceptin receptor
Name:Nociceptin receptor
Type:G Protein-Coupled Receptor (GPCR)
Mol. Mass.:40702.87
Organism:Homo sapiens (Human)
Description:P41146
Residue:370
BDBM50210231
NameBDBM50210231
Synonyms:CHEMBL232478 | N-(2-(1-(bis(2-chlorophenyl)methyl)-4-hydroxypiperidin-4-yl)benzyl)propane-1-sulfonamide
TypeSmall organic molecule
Emp. Form.C28H32Cl2N2O3S
Mol. Mass.547.536
SMILESCCCS(=O)(=O)NCc1ccccc1C1(O)CCN(CC1)C(c1ccccc1Cl)c1ccccc1Cl