Reaction Details
TargetNociceptin receptor
LigandBDBM50210203
Substrate/Competitorn/a
Meas. Tech.ChEMBL_443964 (CHEMBL892111)
Ki 5.9±n/a nM
Citation Ho, GDBercovici, ATulshian, DGreenlee, WJFawzi, AFernandez, XMcLeod, RLSmith Torhan, AZhang, H Synthesis and structure-activity relationships of 4-hydroxy-4-phenylpiperidines as nociceptin receptor ligands: Part 2. Bioorg Med Chem Lett17:3028-33 (2007) 
 
Nociceptin receptor
Name:Nociceptin receptor
Type:G Protein-Coupled Receptor (GPCR)
Mol. Mass.:40702.87
Organism:Homo sapiens (Human)
Description:P41146
Residue:370
BDBM50210203
NameBDBM50210203
Synonyms:1-(bis(2-chlorophenyl)methyl)-4-(2-(morpholinomethyl)phenyl)piperidin-4-ol | CHEMBL394222
TypeSmall organic molecule
Emp. Form.C29H32Cl2N2O2
Mol. Mass.511.483
SMILESOC1(CCN(CC1)C(c1ccccc1Cl)c1ccccc1Cl)c1ccccc1CN1CCOCC1