Reaction Details
TargetNociceptin receptor
LigandBDBM50210233
Substrate/Competitorn/a
Meas. Tech.ChEMBL_443964 (CHEMBL892111)
Ki 34±n/a nM
Citation Ho, GDBercovici, ATulshian, DGreenlee, WJFawzi, AFernandez, XMcLeod, RLSmith Torhan, AZhang, H Synthesis and structure-activity relationships of 4-hydroxy-4-phenylpiperidines as nociceptin receptor ligands: Part 2. Bioorg Med Chem Lett17:3028-33 (2007) 
 
Nociceptin receptor
Name:Nociceptin receptor
Type:G Protein-Coupled Receptor (GPCR)
Mol. Mass.:40702.87
Organism:Homo sapiens (Human)
Description:P41146
Residue:370
BDBM50210233
NameBDBM50210233
Synonyms:1-benzhydryl-4-(2-fluorophenyl)piperidin-4-ol | CHEMBL232476
TypeSmall organic molecule
Emp. Form.C24H24FNO
Mol. Mass.361.4519
SMILESOC1(CCN(CC1)C(c1ccccc1)c1ccccc1)c1ccccc1F