Reaction Details
TargetcGMP-dependent protein kinase
LigandBDBM50210500
Substrate/Competitorn/a
Meas. Tech.ChEMBL_455393 (CHEMBL886170)
IC50 0.1±n/a nM
Citation Scribner, ADennis, RHong, JLee, SMcIntyre, DPerrey, DFeng, DFisher, MWyvratt, MLeavitt, PLiberator, PGurnett, ABrown, CMathew, JThompson, DSchmatz, DBiftu, T Synthesis and biological activity of imidazopyridine anticoccidial agents: part I. Eur J Med Chem42:1334-57 (2007) 
 
cGMP-dependent protein kinase
Name:cGMP-dependent protein kinase
Synonyms:n/a
Type:PROTEIN
Mol. Mass.:112911.27
Organism:Eimeria tenella
Description:ChEMBL_469577
Residue:1003
BDBM50210500
NameBDBM50210500
TypeSmall organic molecule
Emp. Form.C25H29FN6
Mol. Mass.432.5364
SMILESCCCCCNc1nccc(n1)-c1c(nc2cc(CN(C)C)ccn12)-c1ccc(F)cc1