Reaction Details
TargetcGMP-dependent protein kinase
LigandBDBM50210508
Substrate/Competitorn/a
Meas. Tech.ChEMBL_455393 (CHEMBL886170)
IC50 0.08±n/a nM
Citation Scribner, ADennis, RHong, JLee, SMcIntyre, DPerrey, DFeng, DFisher, MWyvratt, MLeavitt, PLiberator, PGurnett, ABrown, CMathew, JThompson, DSchmatz, DBiftu, T Synthesis and biological activity of imidazopyridine anticoccidial agents: part I. Eur J Med Chem42:1334-57 (2007) 
 
cGMP-dependent protein kinase
Name:cGMP-dependent protein kinase
Synonyms:n/a
Type:PROTEIN
Mol. Mass.:112911.27
Organism:Eimeria tenella
Description:ChEMBL_469577
Residue:1003
BDBM50210508
NameBDBM50210508
TypeSmall organic molecule
Emp. Form.C23H23FN6
Mol. Mass.402.4673
SMILESCN(C)Cc1ccn2c(c(nc2c1)-c1ccc(F)cc1)-c1ccnc(NC2CC2)n1