Reaction Details
TargetDelta-type opioid receptor
LigandBDBM50210553
Substrate/Competitorn/a
Meas. Tech.ChEMBL_444081 (CHEMBL893244)
Ki 270±n/a nM
Citation Peng, XKnapp, BIBidlack, JMNeumeyer, JL In-vitro investigation of oxazol and urea analogues of morphinan at opioid receptors. Bioorg Med Chem15:4106-12 (2007) 
 
Delta-type opioid receptor
Name:Delta-type opioid receptor
Type:G Protein-Coupled Receptor (GPCR)
Mol. Mass.:40382.98
Organism:Homo sapiens (Human)
Description:Competition binding assays were carried out using membrane preparations from transfected HN9.10 cells that constitutively expressed the delta opioid receptor.
Residue:372
BDBM50210553
NameBDBM50210553
Synonyms:3-methylurea-N-cyclopropylmethylmorphinan MCL-445
TypeSmall organic molecule
Emp. Form.C23H33N3O
Mol. Mass.367.5276
SMILESCNC(=O)Nc1ccc2C[C@@H]3[C@@H]4CCCC[C@]4(CCN3CC3CCC3)c2c1