Reaction Details
TargetDelta-type opioid receptor
LigandBDBM50210557
Substrate/Competitorn/a
Meas. Tech.ChEMBL_444081 (CHEMBL893244)
Ki 29±n/a nM
Citation Peng, XKnapp, BIBidlack, JMNeumeyer, JL In-vitro investigation of oxazol and urea analogues of morphinan at opioid receptors. Bioorg Med Chem15:4106-12 (2007) 
 
Delta-type opioid receptor
Name:Delta-type opioid receptor
Type:G Protein-Coupled Receptor (GPCR)
Mol. Mass.:40382.98
Organism:Homo sapiens (Human)
Description:Competition binding assays were carried out using membrane preparations from transfected HN9.10 cells that constitutively expressed the delta opioid receptor.
Residue:372
BDBM50210557
NameBDBM50210557
Synonyms:CHEMBL242756 | MCL-147
TypeSmall organic molecule
Emp. Form.C21H27N3S
Mol. Mass.353.524
SMILESNc1nc2cc3c(C[C@@H]4[C@@H]5CCCC[C@]35CCN4CC3CC3)cc2s1