Reaction Details
TargetDelta-type opioid receptor
LigandBDBM50210556
Substrate/Competitorn/a
Meas. Tech.ChEMBL_444081 (CHEMBL893244)
Ki 360±n/a nM
Citation Peng, XKnapp, BIBidlack, JMNeumeyer, JL In-vitro investigation of oxazol and urea analogues of morphinan at opioid receptors. Bioorg Med Chem15:4106-12 (2007) 
 
Delta-type opioid receptor
Name:Delta-type opioid receptor
Type:G Protein-Coupled Receptor (GPCR)
Mol. Mass.:40382.98
Organism:Homo sapiens (Human)
Description:Competition binding assays were carried out using membrane preparations from transfected HN9.10 cells that constitutively expressed the delta opioid receptor.
Residue:372
BDBM50210556
NameBDBM50210556
Synonyms:CHEMBL390912 oxazole-2-one-N-cyclobutylmethylmorphinan
TypeSmall organic molecule
Emp. Form.C22H28N2O2
Mol. Mass.352.4699
SMILESO=c1[nH]c2cc3C[C@@H]4[C@@H]5CCCC[C@]5(CCN4CC4CCC4)c3cc2o1