Reaction Details
TargetMu-type opioid receptor
LigandBDBM50210556
Substrate/Competitorn/a
Meas. Tech.ChEMBL_444079 (CHEMBL893242)
Ki 5.8±n/a nM
Citation Peng, XKnapp, BIBidlack, JMNeumeyer, JL In-vitro investigation of oxazol and urea analogues of morphinan at opioid receptors. Bioorg Med Chem15:4106-12 (2007) 
 
Mu-type opioid receptor
Name:Mu-type opioid receptor
Type:G Protein-Coupled Receptor (GPCR)
Mol. Mass.:44789.51
Organism:Homo sapiens (Human)
Description:P35372
Residue:400
BDBM50210556
NameBDBM50210556
Synonyms:CHEMBL390912 oxazole-2-one-N-cyclobutylmethylmorphinan
TypeSmall organic molecule
Emp. Form.C22H28N2O2
Mol. Mass.352.4699
SMILESO=c1[nH]c2cc3C[C@@H]4[C@@H]5CCCC[C@]5(CCN4CC4CCC4)c3cc2o1