Reaction Details
TargetSodium-dependent serotonin transporter
LigandBDBM50210641
Substrate/Competitorn/a
Meas. Tech.ChEMBL_444106 (CHEMBL892232)
Ki 2.1±n/a nM
Citation Bueno, ABGilmore, JBoot, JBroadmore, RCooper, JFindlay, JHayhurst, LMarcos, AMontero, CMitchell, STimms, GTomlinson, RWallace, LWalton, L Naphthyl piperazines with dual activity as 5-HT1D antagonists and 5-HT reuptake inhibitors. Bioorg Med Chem Lett17:3344-8 (2007) 
 
Sodium-dependent serotonin transporter
Name:Sodium-dependent serotonin transporter
Type:Multi-pass membrane protein
Mol. Mass.:70322.51
Organism:Homo sapiens (Human)
Description:P31645
Residue:630
BDBM50210641
NameBDBM50210641
Synonyms:(S)-1-(2-((S)-4-(6-fluoronaphthalen-2-yl)-2-methylpiperazin-1-yl)ethyl)isochroman-6-carboxamide | CHEMBL391272
TypeSmall organic molecule
Emp. Form.C27H30FN3O2
Mol. Mass.447.5444
SMILESC[C@H]1CN(CCN1CC[C@@H]1OCCc2cc(ccc12)C(N)=O)c1ccc2cc(F)ccc2c1