Reaction Details
TargetSodium-dependent serotonin transporter
LigandBDBM50210642
Substrate/Competitorn/a
Meas. Tech.ChEMBL_444106 (CHEMBL892232)
Ki 2.2±n/a nM
Citation Bueno, ABGilmore, JBoot, JBroadmore, RCooper, JFindlay, JHayhurst, LMarcos, AMontero, CMitchell, STimms, GTomlinson, RWallace, LWalton, L Naphthyl piperazines with dual activity as 5-HT1D antagonists and 5-HT reuptake inhibitors. Bioorg Med Chem Lett17:3344-8 (2007) 
 
Sodium-dependent serotonin transporter
Name:Sodium-dependent serotonin transporter
Type:Multi-pass membrane protein
Mol. Mass.:70322.51
Organism:Homo sapiens (Human)
Description:P31645
Residue:630
BDBM50210642
NameBDBM50210642
Synonyms:(S)-1-(2-((S)-4-(6-cyanonaphthalen-1-yl)-2-methylpiperazin-1-yl)ethyl)-3,4-dihydro-1H-isochromene-6-carboxamide | CHEMBL233210
TypeSmall organic molecule
Emp. Form.C28H30N4O2
Mol. Mass.454.5634
SMILESC[C@H]1CN(CCN1CC[C@@H]1OCCc2cc(ccc12)C(N)=O)c1cccc2cc(ccc12)C#N