Reaction Details
TargetCarbonic anhydrase 2
LigandBDBM50210909
Substrate/Competitorn/a
Meas. Tech.ChEMBL_444150 (CHEMBL893309)
Kd 141±n/a nM
Citation Dudutiene, VBaranauskiene, LMatulis, D Benzimidazo[1,2-c][1,2,3]thiadiazole-7-sulfonamides as inhibitors of carbonic anhydrase. Bioorg Med Chem Lett17:3335-8 (2007) 
 
Carbonic anhydrase 2
Name:Carbonic anhydrase 2
Type:Enzyme Catalytic Domain
Mol. Mass.:29115.93
Organism:Bos taurus
Description:n/a
Residue:260
BDBM50210909
NameBDBM50210909
Synonyms:3-chlorobenzimidazo[1,2-c][1,2,3]thiadiazole-7-sulfonamide | CHEMBL394355
TypeSmall organic molecule
Emp. Form.C8H5ClN4O2S2
Mol. Mass.288.734
SMILESNS(=O)(=O)c1ccc2nc3C(Cl)=S=Nn3c2c1