Reaction Details
TargetCarbonic anhydrase 2
LigandBDBM50210912
Substrate/Competitorn/a
Meas. Tech.ChEMBL_444150 (CHEMBL893309)
Kd 285±n/a nM
Citation Dudutiene, VBaranauskiene, LMatulis, D Benzimidazo[1,2-c][1,2,3]thiadiazole-7-sulfonamides as inhibitors of carbonic anhydrase. Bioorg Med Chem Lett17:3335-8 (2007) 
 
Carbonic anhydrase 2
Name:Carbonic anhydrase 2
Type:Enzyme Catalytic Domain
Mol. Mass.:29115.93
Organism:Bos taurus
Description:n/a
Residue:260
BDBM50210912
NameBDBM50210912
Synonyms:3-phenylthiobenzimidazo[1,2-c][1,2,3]thiadiazol-7-sulfonamide | CHEMBL233246
TypeSmall organic molecule
Emp. Form.C14H10N4O2S3
Mol. Mass.362.45
SMILESNS(=O)(=O)c1ccc2nc3C(Sc4ccccc4)=S=Nn3c2c1