Reaction Details
TargetCarbonic anhydrase 2
LigandBDBM50210913
Substrate/Competitorn/a
Meas. Tech.ChEMBL_444150 (CHEMBL893309)
Kd 391±n/a nM
Citation Dudutiene, VBaranauskiene, LMatulis, D Benzimidazo[1,2-c][1,2,3]thiadiazole-7-sulfonamides as inhibitors of carbonic anhydrase. Bioorg Med Chem Lett17:3335-8 (2007) 
 
Carbonic anhydrase 2
Name:Carbonic anhydrase 2
Type:Enzyme Catalytic Domain
Mol. Mass.:29115.93
Organism:Bos taurus
Description:n/a
Residue:260
BDBM50210913
NameBDBM50210913
Synonyms:3-(N-methylpiperazin)benzimidazo[1,2-c][1,2,3]thiadiazole-7-sulfonamide | CHEMBL438861
TypeSmall organic molecule
Emp. Form.C13H16N6O2S2
Mol. Mass.352.435
SMILESCN1CCN(CC1)C1=S=Nn2c1nc1ccc(cc21)S(N)(=O)=O