Reaction Details
TargetSodium-dependent noradrenaline transporter
LigandBDBM50210953
Substrate/Competitorn/a
Meas. Tech.ChEMBL_444173 (CHEMBL893332)
Ki 1.86±n/a nM
Citation Zeng, FStehouwer, JSJarkas, NVoll, RJWilliams, LCamp, VMVotaw, JROwens, MJKilts, CDNemeroff, CBGoodman, MM Synthesis and biological evaluation of 2beta,3alpha-(substituted phenyl)nortropanes as potential norepinephrine transporter imaging agents. Bioorg Med Chem Lett17:3044-7 (2007) 
 
Sodium-dependent noradrenaline transporter
Name:Sodium-dependent noradrenaline transporter
Type:Multi-pass membrane protein
Mol. Mass.:69337.72
Organism:Homo sapiens (Human)
Description:P23975
Residue:617
BDBM50210953
NameBDBM50210953
Synonyms:(1R,2S,3R,5R)-methyl 3-(4-ethynylphenyl)-8-aza-bicyclo[3.2.1]octane-2-carboxylate | CHEMBL394158
TypeSmall organic molecule
Emp. Form.C17H19NO2
Mol. Mass.269.3383
SMILESCOC(=O)[C@@H]1[C@H]2CC[C@H](C[C@H]1c1ccc(cc1)C#C)N2