Reaction Details
TargetC-C chemokine receptor type 1
LigandBDBM50210972
Substrate/Competitorn/a
Meas. Tech.ChEMBL_444181 (CHEMBL892289)
IC50 12±n/a nM
Citation Xie, YFLake, KLigsay, KKomandla, MSircar, INagarajan, GLi, JXu, KParise, JSchneider, LHuang, DLiu, JDines, KSakurai, NBarbosa, MJack, R Structure-activity relationships of novel, highly potent, selective, and orally active CCR1 antagonists. Bioorg Med Chem Lett17:3367-72 (2007) 
 
C-C chemokine receptor type 1
Name:C-C chemokine receptor type 1
Type:Enzyme
Mol. Mass.:41180.69
Organism:Homo sapiens (Human)
Description:P32246
Residue:355
BDBM50210972
NameBDBM50210972
Synonyms:(R)-3-(2-(2-(4-(4-fluorobenzyl)-2-methylpiperazin-1-yl)-2-oxoethoxy)-5-chlorophenylamino)-4-(2-morpholinoethylamino)cyclobut-3-ene-1,2-dione | CHEMBL234295
TypeSmall organic molecule
Emp. Form.C30H35ClFN5O5
Mol. Mass.600.081
SMILESC[C@@H]1CN(Cc2ccc(F)cc2)CCN1C(=O)COc1ccc(Cl)cc1Nc1c(NCCN2CCOCC2)c(=O)c1=O