Reaction Details
TargetC-C chemokine receptor type 1
LigandBDBM50210971
Substrate/Competitorn/a
Meas. Tech.ChEMBL_444182 (CHEMBL892290)
IC50 5±n/a nM
Citation Xie, YFLake, KLigsay, KKomandla, MSircar, INagarajan, GLi, JXu, KParise, JSchneider, LHuang, DLiu, JDines, KSakurai, NBarbosa, MJack, R Structure-activity relationships of novel, highly potent, selective, and orally active CCR1 antagonists. Bioorg Med Chem Lett17:3367-72 (2007) 
 
C-C chemokine receptor type 1
Name:C-C chemokine receptor type 1
Type:Enzyme
Mol. Mass.:41180.69
Organism:Homo sapiens (Human)
Description:P32246
Residue:355
BDBM50210971
NameBDBM50210971
Synonyms:(R)-3-(2-(2-(4-(4-fluorobenzyl)-2-methylpiperazin-1-yl)-2-oxoethoxy)-5-chlorophenylamino)-4-(2-(piperazin-1-yl)ethylamino)cyclobut-3-ene-1,2-dione | CHEMBL387608
TypeSmall organic molecule
Emp. Form.C30H36ClFN6O4
Mol. Mass.599.096
SMILESC[C@@H]1CN(Cc2ccc(F)cc2)CCN1C(=O)COc1ccc(Cl)cc1Nc1c(NCCN2CCNCC2)c(=O)c1=O