Reaction Details
TargetBeta-lactamase
LigandBDBM23223
Substrate/Competitorn/a
Meas. Tech.ChEMBL_434809 (CHEMBL917037)
IC50 46000±n/a nM
Citation Feng, BYSimeonov, AJadhav, ABabaoglu, KInglese, JShoichet, BKAustin, CP A high-throughput screen for aggregation-based inhibition in a large compound library. J Med Chem50:2385-90 (2007) 
 
Beta-lactamase
Name:Beta-lactamase
Type:Protien
Mol. Mass.:41561.62
Organism:Escherichia coli
Description:P00811
Residue:377
BDBM23223
NameBDBM23223
Synonyms:7-[8-formyl-1,6,7-trihydroxy-3-methyl-5-(propan-2-yl)naphthalen-2-yl]-2,3,8-trihydroxy-6-methyl-4-(propan-2-yl)naphthalene-1-carbaldehyde Gossypol Gossypol, 4 Tash 1 cid_3503
TypeSmall organic molecule
Emp. Form.C30H30O8
Mol. Mass.518.5544
SMILESCC(C)c1c(O)c(O)c(C=O)c2c(O)c(c(C)cc12)-c1c(C)cc2c(C(C)C)c(O)c(O)c(C=O)c2c1O