Reaction Details
TargetGlycogen phosphorylase, liver form
LigandBDBM50211288
Substrate/Competitorn/a
Meas. Tech.ChEMBL_444271 (CHEMBL894512)
Ki 30000±n/a nM
Citation Juhász, LDocsa, TBrunyászki, AGergely, PAntus, S Synthesis and glycogen phosphorylase inhibitor activity of 2,3-dihydrobenzo[1,4]dioxin derivatives. Bioorg Med Chem15:4048-56 (2007) 
 
Glycogen phosphorylase, liver form
Name:Glycogen phosphorylase, liver form
Type:Homodimer
Mol. Mass.:97153.98
Organism:Homo sapiens (Human)
Description:Dimers associate into a tetramer to form the enzymatically active phosphorylase A.
Residue:847
BDBM50211288
NameBDBM50211288
Synonyms:5-[4-(6,7-dibromo-2,3-dihydrobenzo[1,4]dioxin-2-ylmethoxy)-3-methoxy-benzylidene]-thiazolidine-2,4-dione | CHEMBL245060
TypeSmall organic molecule
Emp. Form.C20H15Br2NO6S
Mol. Mass.557.209
SMILESCOc1cc(C=C2SC(O)=NC2=O)ccc1OCC1COc2cc(Br)c(Br)cc2O1