Reaction Details
TargetMitogen-activated protein kinase 10
LigandBDBM50169998
Substrate/Competitorn/a
Meas. Tech.ChEMBL_459041 (CHEMBL925133)
IC50 70±n/a nM
Citation Ijjaali, IPetitet, FDubus, EBarberan, OMichel, A Assessing potency of c-Jun N-terminal kinase 3 (JNK3) inhibitors using 2D molecular descriptors and binary QSAR methodology. Bioorg Med Chem15:4256-64 (2007) 
 
Mitogen-activated protein kinase 10
Name:Mitogen-activated protein kinase 10
Type:Enzyme
Mol. Mass.:52586.89
Organism:Homo sapiens (Human)
Description:n/a
Residue:464
BDBM50169998
NameBDBM50169998
Synonyms:CHEMBL191581 [3H-Benzothiazol-(2Z)-ylidene]-{2-[2-(1H-imidazol-4-yl)-ethylamino]-pyrimidin-4-yl}-acetonitrile
TypeSmall organic molecule
Emp. Form.C18H15N7S
Mol. Mass.361.424
SMILESN#CC(c1nc2ccccc2s1)c1ccnc(NCCc2cnc[nH]2)n1