Reaction Details
TargetGlutamate receptor ionotropic, kainate 2
LigandBDBM50211399
Substrate/Competitorn/a
Meas. Tech.ChEMBL_435007 (CHEMBL920258)
Ki 39±n/a nM
Citation Vogensen, SBFrydenvang, KGreenwood, JRPostorino, GNielsen, BPickering, DSEbert, BBølcho, UEgebjerg, JGajhede, MKastrup, JSJohansen, TNClausen, RPKrogsgaard-Larsen, P A tetrazolyl-substituted subtype-selective AMPA receptor agonist. J Med Chem50:2408-14 (2007) 
 
Glutamate receptor ionotropic, kainate 2
Name:Glutamate receptor ionotropic, kainate 2
Type:PROTEIN
Mol. Mass.:102478.61
Organism:Rattus norvegicus
Description:ChEMBL_936439
Residue:908
BDBM50211399
NameBDBM50211399
Synonyms:(RS)-2-amino-3-[3-hydroxy-5-(2-benzyl-2H-5-tetrazolyl)-4-isoxazolyl]propionic acid CHEMBL388746
TypeSmall organic molecule
Emp. Form.C14H14N6O4
Mol. Mass.330.2988
SMILESNC(Cc1c(o[nH]c1=O)-c1nnn(Cc2ccccc2)n1)C(O)=O