Reaction Details
TargetMitogen-activated protein kinase 9
LigandBDBM50211428
Substrate/Competitorn/a
Meas. Tech.ChEMBL_455591 (CHEMBL886371)
IC50 5±n/a nM
Citation Alam, MBeevers, RECeska, TDavenport, RJDickson, KMFortunato, MGowers, LHaughan, AFJames, LAJones, MWKinsella, NLowe, CMeissner, JWNicolas, ALPerry, BGPhillips, DJPitt, WRPlatt, ARatcliffe, AJSharpe, ATait, LJ Synthesis and SAR of aminopyrimidines as novel c-Jun N-terminal kinase (JNK) inhibitors. Bioorg Med Chem Lett17:3463-7 (2007) 
 
Mitogen-activated protein kinase 9
Name:Mitogen-activated protein kinase 9
Type:Enzyme
Mol. Mass.:48131.49
Organism:Homo sapiens (Human)
Description:JNK-2 was purchased from Upstate Cell Signaling Solutions (formerly Upstate Biotechnology).
Residue:424
BDBM50211428
NameBDBM50211428
Synonyms:CHEMBL245936 | N-ethyl-4-(4-(2-phenyl-1H-indol-3-yl)pyrimidin-2-ylamino)piperidine-1-carboxamide
TypeSmall organic molecule
Emp. Form.C26H28N6O
Mol. Mass.440.5401
SMILESCCNC(=O)N1CCC(CC1)Nc1nccc(n1)-c1c([nH]c2ccccc12)-c1ccccc1