Reaction Details
TargetMitogen-activated protein kinase 8
LigandBDBM50211443
Substrate/Competitorn/a
Meas. Tech.ChEMBL_455590 (CHEMBL886370)
IC50 29±n/a nM
Citation Alam, MBeevers, RECeska, TDavenport, RJDickson, KMFortunato, MGowers, LHaughan, AFJames, LAJones, MWKinsella, NLowe, CMeissner, JWNicolas, ALPerry, BGPhillips, DJPitt, WRPlatt, ARatcliffe, AJSharpe, ATait, LJ Synthesis and SAR of aminopyrimidines as novel c-Jun N-terminal kinase (JNK) inhibitors. Bioorg Med Chem Lett17:3463-7 (2007) 
 
Mitogen-activated protein kinase 8
Name:Mitogen-activated protein kinase 8
Type:Enzyme
Mol. Mass.:48297.57
Organism:Homo sapiens (Human)
Description:JNK-1 was purchased from Upstate Cell Signaling Solutions (formerly Upstate Biotechnology).
Residue:427
BDBM50211443
NameBDBM50211443
Synonyms:(3S)-3-(5-chloro-4-(1H-indol-3-yl)pyrimidin-2-ylamino)-N-ethylpiperidine-1-carboxamide | CHEMBL392614
TypeSmall organic molecule
Emp. Form.C20H23ClN6O
Mol. Mass.398.889
SMILESCCNC(=O)N1CCC[C@@H](C1)Nc1ncc(Cl)c(n1)-c1c[nH]c2ccccc12