Reaction Details
TargetC-X-C chemokine receptor type 2
LigandBDBM50211453
Substrate/Competitorn/a
Meas. Tech.ChEMBL_455595 (CHEMBL886375)
Ki 2±n/a nM
Citation Chao, JTaveras, AGChao, JAki, CDwyer, MYu, YPurakkattle, BRindgen, DJakway, JHipkin, WFosetta, JFan, XLundell, DFine, JMinnicozzi, MPhillips, JMerritt, JR C(4)-alkyl substituted furanyl cyclobutenediones as potent, orally bioavailable CXCR2 and CXCR1 receptor antagonists. Bioorg Med Chem Lett17:3778-83 (2007) 
 
C-X-C chemokine receptor type 2
Name:C-X-C chemokine receptor type 2
Type:Protein
Mol. Mass.:40767.88
Organism:Homo sapiens (Human)
Description:P25025
Residue:360
BDBM50211453
NameBDBM50211453
Synonyms:(R)-3-(2-(1-(4-butylfuran-2-yl)propylamino)-3,4-dioxocyclobut-1-enylamino)-2-hydroxy-N,N-dimethylbenzamide | CHEMBL246106
TypeSmall organic molecule
Emp. Form.C24H29N3O5
Mol. Mass.439.5042
SMILESCCCCc1coc(c1)[C@@H](CC)Nc1c(Nc2cccc(C(=O)N(C)C)c2O)c(=O)c1=O