Reaction Details
TargetC-X-C chemokine receptor type 1
LigandBDBM50211458
Substrate/Competitorn/a
Meas. Tech.ChEMBL_455596 (CHEMBL886376)
Ki 3±n/a nM
Citation Chao, JTaveras, AGChao, JAki, CDwyer, MYu, YPurakkattle, BRindgen, DJakway, JHipkin, WFosetta, JFan, XLundell, DFine, JMinnicozzi, MPhillips, JMerritt, JR C(4)-alkyl substituted furanyl cyclobutenediones as potent, orally bioavailable CXCR2 and CXCR1 receptor antagonists. Bioorg Med Chem Lett17:3778-83 (2007) 
 
C-X-C chemokine receptor type 1
Name:C-X-C chemokine receptor type 1
Type:Enzyme
Mol. Mass.:39803.83
Organism:Homo sapiens (Human)
Description:P25024
Residue:350
BDBM50211458
NameBDBM50211458
Synonyms:(R)-2-hydroxy-3-(2-(1-(4-isopropylfuran-2-yl)propylamino)-3,4-dioxocyclobut-1-enylamino)-N,N-dimethylbenzamide | CHEMBL246108
TypeSmall organic molecule
Emp. Form.C23H27N3O5
Mol. Mass.425.4776
SMILESCC[C@@H](Nc1c(Nc2cccc(C(=O)N(C)C)c2O)c(=O)c1=O)c1cc(co1)C(C)C