Reaction Details
TargetCoagulation factor X
LigandBDBM50211576
Substrate/Competitorn/a
Meas. Tech.ChEMBL_438714 (CHEMBL889048)
Ki 0.92±n/a nM
Citation Dönnecke, DSchweinitz, AStürzebecher, ASteinmetzer, PSchuster, MStürzebecher, UNicklisch, SStürzebecher, JSteinmetzer, T From selective substrate analogue factor Xa inhibitors to dual inhibitors of thrombin and factor Xa. Part 3. Bioorg Med Chem Lett17:3322-9 (2007) 
 
Coagulation factor X
Name:Coagulation factor X
Type:Enzyme
Mol. Mass.:54726.60
Organism:Homo sapiens (Human)
Description:n/a
Residue:488
BDBM50211576
NameBDBM50211576
Synonyms:CHEMBL228341 | [(R)-1-[(S)-2-(2-aminomethyl-5-chloro-benzylcarbamoyl)-pyrrolidine-1-carbonyl]-3-(1-oxy-pyridin-2-yl)-propylamino]-acetic acid hexyl ester
TypeSmall organic molecule
Emp. Form.C30H42ClN5O5
Mol. Mass.588.138
SMILESCCCCCCOC(=O)CN[C@H](CCc1cccc[n+]1[O-])C(=O)N1CCC[C@H]1C(=O)NCc1cc(Cl)ccc1CN