Reaction Details
TargetCannabinoid receptor 1
LigandBDBM50211611
Substrate/Competitorn/a
Meas. Tech.ChEMBL_455617 (CHEMBL886398)
Ki 10±n/a nM
Citation Lavey, BJKozlowski, JAShankar, BBSpitler, JMZhou, GYang, DYShu, YWong, MKWong, SCShih, NYWu, JMcCombie, SWRizvi, RWolin, RLLunn, CA Optimization of triaryl bis-sulfones as cannabinoid-2 receptor ligands. Bioorg Med Chem Lett17:3760-4 (2007) 
 
Cannabinoid receptor 1
Name:Cannabinoid receptor 1
Type:G Protein-Coupled Receptor (GPCR)
Mol. Mass.:52868.96
Organism:Homo sapiens (Human)
Description:P21554
Residue:472
BDBM50211611
NameBDBM50211611
Synonyms:(S)-N-(1-(4-(4-amino-2-(2-fluorophenylsulfonyl)phenylsulfonyl)phenyl)ethyl)trifluoromethanesulfonamide | CHEMBL397855
TypeSmall organic molecule
Emp. Form.C21H18F4N2O6S3
Mol. Mass.566.566
SMILESC[C@H](NS(=O)(=O)C(F)(F)F)c1ccc(cc1)S(=O)(=O)c1ccc(N)cc1S(=O)(=O)c1ccccc1F