Reaction Details
TargetCannabinoid receptor 1
LigandBDBM50211614
Substrate/Competitorn/a
Meas. Tech.ChEMBL_455617 (CHEMBL886398)
Ki 22±n/a nM
Citation Lavey, BJKozlowski, JAShankar, BBSpitler, JMZhou, GYang, DYShu, YWong, MKWong, SCShih, NYWu, JMcCombie, SWRizvi, RWolin, RLLunn, CA Optimization of triaryl bis-sulfones as cannabinoid-2 receptor ligands. Bioorg Med Chem Lett17:3760-4 (2007) 
 
Cannabinoid receptor 1
Name:Cannabinoid receptor 1
Type:G Protein-Coupled Receptor (GPCR)
Mol. Mass.:52868.96
Organism:Homo sapiens (Human)
Description:P21554
Residue:472
BDBM50211614
NameBDBM50211614
Synonyms:(S)-N-(1-(4-(4-chloro-2-(2-fluoro-6-(methylamino)phenylsulfonyl)phenylsulfonyl)phenyl)ethyl)trifluoromethanesulfonamide | CHEMBL393031
TypeSmall organic molecule
Emp. Form.C22H19ClF4N2O6S3
Mol. Mass.615.038
SMILESCNc1cccc(F)c1S(=O)(=O)c1cc(Cl)ccc1S(=O)(=O)c1ccc(cc1)[C@H](C)NS(=O)(=O)C(F)(F)F