Reaction Details
TargetCannabinoid receptor 1
LigandBDBM50211621
Substrate/Competitorn/a
Meas. Tech.ChEMBL_455617 (CHEMBL886398)
Ki 17±n/a nM
Citation Lavey, BJKozlowski, JAShankar, BBSpitler, JMZhou, GYang, DYShu, YWong, MKWong, SCShih, NYWu, JMcCombie, SWRizvi, RWolin, RLLunn, CA Optimization of triaryl bis-sulfones as cannabinoid-2 receptor ligands. Bioorg Med Chem Lett17:3760-4 (2007) 
 
Cannabinoid receptor 1
Name:Cannabinoid receptor 1
Type:G Protein-Coupled Receptor (GPCR)
Mol. Mass.:52868.96
Organism:Homo sapiens (Human)
Description:P21554
Residue:472
BDBM50211621
NameBDBM50211621
Synonyms:(S)-N-(1-(4-(4-chloro-2-(2-fluorophenylsulfonyl)phenylsulfonyl)phenyl)ethyl)-3,3,3-trifluoropropan-1-amine | CHEMBL245760
TypeSmall organic molecule
Emp. Form.C23H20ClF4NO4S2
Mol. Mass.549.986
SMILESC[C@H](NCCC(F)(F)F)c1ccc(cc1)S(=O)(=O)c1ccc(Cl)cc1S(=O)(=O)c1ccccc1F