Reaction Details
TargetCannabinoid receptor 1
LigandBDBM50211632
Substrate/Competitorn/a
Meas. Tech.ChEMBL_455617 (CHEMBL886398)
Ki 1.3±n/a nM
Citation Lavey, BJKozlowski, JAShankar, BBSpitler, JMZhou, GYang, DYShu, YWong, MKWong, SCShih, NYWu, JMcCombie, SWRizvi, RWolin, RLLunn, CA Optimization of triaryl bis-sulfones as cannabinoid-2 receptor ligands. Bioorg Med Chem Lett17:3760-4 (2007) 
 
Cannabinoid receptor 1
Name:Cannabinoid receptor 1
Type:G Protein-Coupled Receptor (GPCR)
Mol. Mass.:52868.96
Organism:Homo sapiens (Human)
Description:P21554
Residue:472
BDBM50211632
NameBDBM50211632
Synonyms:(S)-trifluoro-N-(1-(4-(2-(2-fluorophenylsulfonyl)-4-hydroxyphenylsulfonyl)phenyl)ethyl)methanesulfonamide | CHEMBL245961
TypeSmall organic molecule
Emp. Form.C21H17F4NO7S3
Mol. Mass.567.551
SMILESC[C@H](NS(=O)(=O)C(F)(F)F)c1ccc(cc1)S(=O)(=O)c1ccc(O)cc1S(=O)(=O)c1ccccc1F