Reaction Details
TargetCannabinoid receptor 1
LigandBDBM50211639
Substrate/Competitorn/a
Meas. Tech.ChEMBL_455617 (CHEMBL886398)
Ki 25±n/a nM
Citation Lavey, BJKozlowski, JAShankar, BBSpitler, JMZhou, GYang, DYShu, YWong, MKWong, SCShih, NYWu, JMcCombie, SWRizvi, RWolin, RLLunn, CA Optimization of triaryl bis-sulfones as cannabinoid-2 receptor ligands. Bioorg Med Chem Lett17:3760-4 (2007) 
 
Cannabinoid receptor 1
Name:Cannabinoid receptor 1
Type:G Protein-Coupled Receptor (GPCR)
Mol. Mass.:52868.96
Organism:Homo sapiens (Human)
Description:P21554
Residue:472
BDBM50211639
NameBDBM50211639
Synonyms:(S)-trifluoro-N-(1-(4-(2-(2-fluorophenylsulfonyl)phenylsulfonyl)phenyl)ethyl)methanesulfonamide | CHEMBL245959
TypeSmall organic molecule
Emp. Form.C21H17F4NO6S3
Mol. Mass.551.551
SMILESC[C@H](NS(=O)(=O)C(F)(F)F)c1ccc(cc1)S(=O)(=O)c1ccccc1S(=O)(=O)c1ccccc1F