Reaction Details
TargetLysophosphatidic acid receptor 1
LigandBDBM50170859
Substrate/Competitorn/a
Meas. Tech.ChEMBL_455638 (CHEMBL903636)
IC50 160±n/a nM
Citation Yamamoto, TFujita, KAsari, SChiba, AKataba, YOhsumi, KOhmuta, NIida, YIjichi, CIwayama, SFukuchi, NShoji, M Synthesis and evaluation of isoxazole derivatives as lysophosphatidic acid (LPA) antagonists. Bioorg Med Chem Lett17:3736-40 (2007) 
 
Lysophosphatidic acid receptor 1
Name:Lysophosphatidic acid receptor 1
Type:PROTEIN
Mol. Mass.:41130.42
Organism:Rattus norvegicus
Description:ChEMBL_329844
Residue:364
BDBM50170859
NameBDBM50170859
Synonyms:3-(4-(4-((1-(2-chlorophenyl)ethoxy)carbonyl)-3-methylisoxazol-5-yl)benzylthio)propanoic acid 3-(4-{4-[1-(2-Chloro-phenyl)-ethoxycarbonylamino]-3-methyl-isoxazol-5-yl}-benzylsulfanyl)-propionic acid | CHEMBL361501
TypeSmall organic molecule
Emp. Form.C23H23ClN2O5S
Mol. Mass.474.957
SMILESCC(OC(=O)Nc1c(C)noc1-c1ccc(CSCCC(O)=O)cc1)c1ccccc1Cl