Reaction Details
TargetcGMP-dependent protein kinase
LigandBDBM50211812
Substrate/Competitorn/a
Meas. Tech.ChEMBL_447195 (CHEMBL897494)
IC50 0.11±n/a nM
Citation Liang, GBQian, XFeng, DFisher, MBrown, CMGurnett, ALeavitt, PSLiberator, PAMisura, ASTamas, TSchmatz, DMWyvratt, MBiftu, T Synthesis and SAR studies of potent imidazopyridine anticoccidial agents. Bioorg Med Chem Lett17:3558-61 (2007) 
 
cGMP-dependent protein kinase
Name:cGMP-dependent protein kinase
Synonyms:n/a
Type:PROTEIN
Mol. Mass.:112911.27
Organism:Eimeria tenella
Description:ChEMBL_469577
Residue:1003
BDBM50211812
NameBDBM50211812
TypeSmall organic molecule
Emp. Form.C30H31FN6
Mol. Mass.494.6057
SMILESCC(C)N(C)Cc1ccn2c(c(nc2c1)-c1ccc(F)cc1)-c1ccnc(N[C@@H](C)c2ccccc2)n1