Reaction Details
TargetCytochrome P450 2D6
LigandBDBM50211843
Substrate/Competitorn/a
Meas. Tech.ChEMBL_436455 (CHEMBL904761)
IC50>100000±n/a nM
Citation Giblin, GMO'Shaughnessy, CTNaylor, AMitchell, WLEatherton, AJSlingsby, BPRawlings, DAGoldsmith, PBrown, AJHaslam, CPClayton, NMWilson, AWChessell, IPWittington, ARGreen, R Discovery of 2-[(2,4-dichlorophenyl)amino]-N-[(tetrahydro- 2H-pyran-4-yl)methyl]-4-(trifluoromethyl)- 5-pyrimidinecarboxamide, a selective CB2 receptor agonist for the treatment of inflammatory pain. J Med Chem50:2597-600 (2007) 
 
Cytochrome P450 2D6
Name:Cytochrome P450 2D6
Type:Protein
Mol. Mass.:55774.82
Organism:Homo sapiens (Human)
Description:P10635
Residue:497
BDBM50211843
NameBDBM50211843
Synonyms:2-(2,4-dichlorophenylamino)-4-trifluoromethyl-pyrimidine-5-carboxylic acid N-(tetrahydropyran-4-ylmethyl)amide CHEMBL225411 GW-842166X
TypeSmall organic molecule
Emp. Form.C18H17Cl2F3N4O2
Mol. Mass.449.254
SMILESFC(F)(F)c1nc(Nc2ccc(Cl)cc2Cl)ncc1C(=O)NCC1CCOCC1