Reaction Details
TargetMelatonin receptor type 1B
LigandBDBM50212045
Substrate/Competitorn/a
Meas. Tech.ChEMBL_436507 (CHEMBL904813)
Ki 7.92±n/a nM
Citation Di Giacomo, BBedini, ASpadoni, GTarzia, GFraschini, FPannacci, MLucini, V Synthesis and biological activity of new melatonin dimeric derivatives. Bioorg Med Chem15:4643-50 (2007) 
 
Melatonin receptor type 1B
Name:Melatonin receptor type 1B
Type:Enzyme
Mol. Mass.:40203.54
Organism:Homo sapiens (Human)
Description:P49286
Residue:362
BDBM50212045
NameBDBM50212045
Synonyms:8-(3-(2-acetamidoethyl)-5-methoxy-1H-indole-2-carbonyloxy)octyl 3-(2-acetamidoethyl)-5-methoxy-1Hindole-2-carboxylate | CHEMBL387655
TypeSmall organic molecule
Emp. Form.C36H46N4O8
Mol. Mass.662.7724
SMILESCOc1ccc2[nH]c(C(=O)OCCCCCCCCOC(=O)c3[nH]c4ccc(OC)cc4c3CCNC(C)=O)c(CCNC(C)=O)c2c1