Reaction Details
TargetEstrogen receptor beta
LigandBDBM50212147
Substrate/Competitorn/a
Meas. Tech.ChEMBL_438781 (CHEMBL889119)
Ki 0.48±n/a nM
Citation Richardson, TIFrank, SAWang, MClarke, CAJones, SAYing, BPKohlman, DTWallace, OBShepherd, TADally, RDPalkowitz, ADGeiser, AGBryant, HUHenck, JWCohen, IRRudmann, DGMcCann, DJCoutant, DEOldham, SWHummel, CWFong, KCHinklin, RLewis, GTian, HDodge, JA Structure-activity relationships of SERMs optimized for uterine antagonism and ovarian safety. Bioorg Med Chem Lett17:3544-9 (2007) 
 
Estrogen receptor beta
Name:Estrogen receptor beta
Type:Protein
Mol. Mass.:59238.43
Organism:Homo sapiens (Human)
Description:Q92731
Residue:530
BDBM50212147
NameBDBM50212147
Synonyms:6-(4-hydroxyphenyl)-5-(4-(2-(piperidin-1-yl)ethoxy)phenoxy)naphthalen-2-ol | CHEMBL244000
TypeSmall organic molecule
Emp. Form.C29H29NO4
Mol. Mass.455.5449
SMILESOc1ccc(cc1)-c1ccc2cc(O)ccc2c1Oc1ccc(OCCN2CCCCC2)cc1