Reaction Details
TargetEstrogen receptor
LigandBDBM50212151
Substrate/Competitorn/a
Meas. Tech.ChEMBL_438780 (CHEMBL889118)
Ki 1.09±n/a nM
Citation Richardson, TIFrank, SAWang, MClarke, CAJones, SAYing, BPKohlman, DTWallace, OBShepherd, TADally, RDPalkowitz, ADGeiser, AGBryant, HUHenck, JWCohen, IRRudmann, DGMcCann, DJCoutant, DEOldham, SWHummel, CWFong, KCHinklin, RLewis, GTian, HDodge, JA Structure-activity relationships of SERMs optimized for uterine antagonism and ovarian safety. Bioorg Med Chem Lett17:3544-9 (2007) 
 
Estrogen receptor
Name:Estrogen receptor
Type:Protein
Mol. Mass.:66230.44
Organism:Homo sapiens (Human)
Description:P03372
Residue:595
BDBM50212151
NameBDBM50212151
Synonyms:6-(4-(methylsulfonyl)cyclohex-1-enyl)-5-(4-(2-(piperidin-1-yl)ethoxy)phenoxy)naphthalen-2-ol | CHEMBL390448
TypeSmall organic molecule
Emp. Form.C30H35NO5S
Mol. Mass.521.668
SMILESCS(=O)(=O)C1CCC(=CC1)c1ccc2cc(O)ccc2c1Oc1ccc(OCCN2CCCCC2)cc1