Reaction Details
TargetEstrogen receptor beta
LigandBDBM50212159
Substrate/Competitorn/a
Meas. Tech.ChEMBL_438781 (CHEMBL889119)
Ki 0.63±n/a nM
Citation Richardson, TIFrank, SAWang, MClarke, CAJones, SAYing, BPKohlman, DTWallace, OBShepherd, TADally, RDPalkowitz, ADGeiser, AGBryant, HUHenck, JWCohen, IRRudmann, DGMcCann, DJCoutant, DEOldham, SWHummel, CWFong, KCHinklin, RLewis, GTian, HDodge, JA Structure-activity relationships of SERMs optimized for uterine antagonism and ovarian safety. Bioorg Med Chem Lett17:3544-9 (2007) 
 
Estrogen receptor beta
Name:Estrogen receptor beta
Type:Protein
Mol. Mass.:59238.43
Organism:Homo sapiens (Human)
Description:Q92731
Residue:530
BDBM50212159
NameBDBM50212159
Synonyms:2-(4-isopropylphenyl)-3-(4-(2-(piperidin-1-yl)ethoxy)phenoxy)benzo[b]thiophen-6-ol | CHEMBL243970
TypeSmall organic molecule
Emp. Form.C30H33NO3S
Mol. Mass.487.653
SMILESCC(C)c1ccc(cc1)-c1sc2cc(O)ccc2c1Oc1ccc(OCCN2CCCCC2)cc1