Reaction Details
TargetEstrogen receptor
LigandBDBM50212160
Substrate/Competitorn/a
Meas. Tech.ChEMBL_438780 (CHEMBL889118)
Ki 0.24±n/a nM
Citation Richardson, TIFrank, SAWang, MClarke, CAJones, SAYing, BPKohlman, DTWallace, OBShepherd, TADally, RDPalkowitz, ADGeiser, AGBryant, HUHenck, JWCohen, IRRudmann, DGMcCann, DJCoutant, DEOldham, SWHummel, CWFong, KCHinklin, RLewis, GTian, HDodge, JA Structure-activity relationships of SERMs optimized for uterine antagonism and ovarian safety. Bioorg Med Chem Lett17:3544-9 (2007) 
 
Estrogen receptor
Name:Estrogen receptor
Type:Protein
Mol. Mass.:66230.44
Organism:Homo sapiens (Human)
Description:P03372
Residue:595
BDBM50212160
NameBDBM50212160
Synonyms:3-(6-hydroxy-1-(4-(2-(piperidin-1-yl)ethoxy)phenoxy)naphthalen-2-yl)benzonitrile | CHEMBL243999
TypeSmall organic molecule
Emp. Form.C30H28N2O3
Mol. Mass.464.5549
SMILESOc1ccc2c(Oc3ccc(OCCN4CCCCC4)cc3)c(ccc2c1)-c1cccc(c1)C#N