Reaction Details
TargetEstrogen receptor
LigandBDBM19967
Substrate/Competitorn/a
Meas. Tech.ChEMBL_438780 (CHEMBL889118)
Ki 0.24±n/a nM
Citation Richardson, TIFrank, SAWang, MClarke, CAJones, SAYing, BPKohlman, DTWallace, OBShepherd, TADally, RDPalkowitz, ADGeiser, AGBryant, HUHenck, JWCohen, IRRudmann, DGMcCann, DJCoutant, DEOldham, SWHummel, CWFong, KCHinklin, RLewis, GTian, HDodge, JA Structure-activity relationships of SERMs optimized for uterine antagonism and ovarian safety. Bioorg Med Chem Lett17:3544-9 (2007) 
 
Estrogen receptor
Name:Estrogen receptor
Type:Protein
Mol. Mass.:66230.44
Organism:Homo sapiens (Human)
Description:P03372
Residue:595
BDBM19967
NameBDBM19967
Synonyms:6-(4-fluorophenyl)-5-{4-[2-(piperidin-1-yl)ethoxy]phenoxy}naphthalen-2-ol LY2066948 analogue, 17
TypeSmall organic molecule
Emp. Form.C29H28FNO3
Mol. Mass.457.5359
SMILESOc1ccc2c(Oc3ccc(OCCN4CCCCC4)cc3)c(ccc2c1)-c1ccc(F)cc1