Reaction Details
TargetIsoform 1 of Steroid hormone receptor ERR2 (ERRbeta2-delta10)
LigandBDBM50212161
Substrate/Competitorn/a
Meas. Tech.ChEMBL_455656 (CHEMBL886439)
IC50 526±n/a nM
Citation Vu, ATCampbell, ANHarris, HAUnwalla, RJManas, ESMewshaw, RE ERbeta ligands. Part 6: 6H-Chromeno[4,3-b]quinolines as a new series of estrogen receptor beta-selective ligands. Bioorg Med Chem Lett17:4053-6 (2007) 
 
Isoform 1 of Steroid hormone receptor ERR2 (ERRbeta2-delta10)
Name:Isoform 1 of Steroid hormone receptor ERR2 (ERRbeta2-delta10)
Type:PROTEIN
Mol. Mass.:56220.72
Organism:Homo sapiens (Human)
Description:ChEMBL_940755
Residue:508
BDBM50212161
NameBDBM50212161
Synonyms:7-vinyl-6H-chromeno[4,3-b]quinoline-3,9-diol | CHEMBL250300
TypeSmall organic molecule
Emp. Form.C18H13NO3
Mol. Mass.291.3007
SMILESOc1ccc-2c(OCc3c(C=C)c4cc(O)ccc4nc-23)c1