Reaction Details
TargetMalonyl-CoA decarboxylase, mitochondrial
LigandBDBM50183307
Substrate/Competitorn/a
Meas. Tech.ChEMBL_459062 (CHEMBL925154)
IC50 8±n/a nM
Citation Patel, MRTalele, TT 3D-QSAR studies on malonyl coenzyme A decarboxylase inhibitors. Bioorg Med Chem15:4470-81 (2007) 
 
Malonyl-CoA decarboxylase, mitochondrial
Name:Malonyl-CoA decarboxylase, mitochondrial
Type:PROTEIN
Mol. Mass.:55018.37
Organism:Homo sapiens (Human)
Description:ChEMBL_665404
Residue:493
BDBM50183307
NameBDBM50183307
Synonyms:5-(N-(4-(1,1,1,3,3,3-hexafluoro-2-hydroxypropan-2-yl)phenyl)isobutyramido)pentanoic acid CHEMBL380868
TypeSmall organic molecule
Emp. Form.C18H21F6NO4
Mol. Mass.429.3541
SMILESCC(C)C(=O)N(CCCCC(O)=O)c1ccc(cc1)C(O)(C(F)(F)F)C(F)(F)F