Reaction Details
TargetRetinoic acid receptor RXR-alpha
LigandBDBM50212276
Substrate/Competitorn/a
Meas. Tech.ChEMBL_455695 (CHEMBL886478)
EC50 173.1±n/a nM
Citation Lagu, BPio, BLebedev, RYang, MPelton, PD RXR-LXR heterodimer modulators for the potential treatment of dyslipidemia. Bioorg Med Chem Lett17:3497-503 (2007) 
 
Retinoic acid receptor RXR-alpha
Name:Retinoic acid receptor RXR-alpha
Type:PROTEIN
Mol. Mass.:50820.38
Organism:Homo sapiens (Human)
Description:ChEMBL_1456363
Residue:462
BDBM50212276
NameBDBM50212276
Synonyms:3-(3-(4-ethyl-2,2,7-trimethyl-3-oxo-3,4-dihydro-2H-benzo[b][1,4]oxazin-6-yl)-4-(trifluoromethoxy)phenyl)acrylic acid | CHEMBL247856
TypeSmall organic molecule
Emp. Form.C23H22F3NO5
Mol. Mass.449.4197
SMILESCCN1C(=O)C(C)(C)Oc2cc(C)c(cc12)-c1cc(\C=C\C(O)=O)ccc1OC(F)(F)F