Reaction Details
TargetMu-type opioid receptor
LigandBDBM50212292
Substrate/Competitorn/a
Meas. Tech.ChEMBL_436581 (CHEMBL904889)
IC50 440±n/a nM
Citation Zhang, ALi, FDing, CYao, QKnapp, BIBidlack, JMNeumeyer, JL Synthesis and pharmacological evaluation of 6,7-indolo/thiazolo-morphinans--further SAR of levorphanol. J Med Chem50:2747-51 (2007) 
 
Mu-type opioid receptor
Name:Mu-type opioid receptor
Type:G Protein-Coupled Receptor (GPCR)
Mol. Mass.:44789.51
Organism:Homo sapiens (Human)
Description:P35372
Residue:400
BDBM50212292
NameBDBM50212292
Synonyms:(1S,13R,14R)-24-(cyclopropylmethyl)-19-methoxy-4,24-diazahexacyclo[12.7.3.0^{1,13}.0^{3,11}.0^{5,10}.0^{16,21}]tetracosa-3(11),5(10),6,8,16(21),17,19-heptaene | CHEMBL226113
TypeSmall organic molecule
Emp. Form.C27H30N2O
Mol. Mass.398.5399
SMILESCOc1ccc2C[C@@H]3[C@@H]4Cc5c(C[C@]4(CCN3CC3CC3)c2c1)[nH]c1ccccc51