Reaction Details
TargetDelta-type opioid receptor
LigandBDBM50212293
Substrate/Competitorn/a
Meas. Tech.ChEMBL_436576 (CHEMBL904884)
Ki 0.230000±n/a nM
Citation Zhang, ALi, FDing, CYao, QKnapp, BIBidlack, JMNeumeyer, JL Synthesis and pharmacological evaluation of 6,7-indolo/thiazolo-morphinans--further SAR of levorphanol. J Med Chem50:2747-51 (2007) 
 
Delta-type opioid receptor
Name:Delta-type opioid receptor
Type:G Protein-Coupled Receptor (GPCR)
Mol. Mass.:40382.98
Organism:Homo sapiens (Human)
Description:Competition binding assays were carried out using membrane preparations from transfected HN9.10 cells that constitutively expressed the delta opioid receptor.
Residue:372
BDBM50212293
NameBDBM50212293
Synonyms:(1S,9R,10R)-5-amino-20-(cyclopropylmethyl)-6-thia-4,20-diazapentacyclo[8.7.3.0^{1,9}.0^{3,7}.0^{12,17}]icosa-3(7),4,12(17),13,15-pentaen-15-ol | CHEMBL226217
TypeSmall organic molecule
Emp. Form.C21H25N3OS
Mol. Mass.367.508
SMILESNc1nc2C[C@]34CCN(CC5CC5)[C@H](Cc5ccc(O)cc35)[C@@H]4Cc2s1