Reaction Details
TargetDelta-type opioid receptor
LigandBDBM50212298
Substrate/Competitorn/a
Meas. Tech.ChEMBL_436584 (CHEMBL904892)
EC50 23±n/a nM
Citation Zhang, ALi, FDing, CYao, QKnapp, BIBidlack, JMNeumeyer, JL Synthesis and pharmacological evaluation of 6,7-indolo/thiazolo-morphinans--further SAR of levorphanol. J Med Chem50:2747-51 (2007) 
 
Delta-type opioid receptor
Name:Delta-type opioid receptor
Type:G Protein-Coupled Receptor (GPCR)
Mol. Mass.:40382.98
Organism:Homo sapiens (Human)
Description:Competition binding assays were carried out using membrane preparations from transfected HN9.10 cells that constitutively expressed the delta opioid receptor.
Residue:372
BDBM50212298
NameBDBM50212298
Synonyms:(1S,13R,14R)-24-(cyclobutylmethyl)-19-methoxy-4,24-diazahexacyclo[12.7.3.0^{1,13}.0^{3,11}.0^{5,10}.0^{16,21}]tetracosa-3(11),5(10),6,8,16(21),17,19-heptaene | CHEMBL375503
TypeSmall organic molecule
Emp. Form.C28H32N2O
Mol. Mass.412.5665
SMILESCOc1ccc2C[C@@H]3[C@@H]4Cc5c(C[C@]4(CCN3CC3CCC3)c2c1)[nH]c1ccccc51