Reaction Details
TargetSerine/threonine-protein kinase Chk1
LigandBDBM50212512
Substrate/Competitorn/a
Meas. Tech.ChEMBL_447306 (CHEMBL896339)
IC50 9.3±n/a nM
Citation Tong, YClaiborne, APyzytulinska, MTao, ZFStewart, KDKovar, PChen, ZCredo, RBGuan, RMerta, PJZhang, HBouska, JEveritt, EAMurry, BPHickman, DStratton, TJWu, JRosenberg, SHSham, HLSowin, TJLin, NH 1,4-Dihydroindeno[1,2-c]pyrazoles as potent checkpoint kinase 1 inhibitors: extended exploration on phenyl ring substitutions and preliminary ADME/PK studies. Bioorg Med Chem Lett17:3618-23 (2007) 
 
Serine/threonine-protein kinase Chk1
Name:Serine/threonine-protein kinase Chk1
Type:Enzyme Catalytic Domain
Mol. Mass.:54443.02
Organism:Homo sapiens (Human)
Description:gi_166295192
Residue:476
BDBM50212512
NameBDBM50212512
Synonyms:3-(4'-hydroxy-biphenyl-4-yl)-1,4-dihydro-indeno[1,2-c]pyrazole-6-carboxylic acid (pyridin-2-ylmethyl)-amide | CHEMBL234479
TypeSmall organic molecule
Emp. Form.C29H22N4O2
Mol. Mass.458.5106
SMILESOc1ccc(cc1)-c1ccc(cc1)-c1n[nH]c-2c1Cc1cc(ccc-21)C(=O)NCc1ccccn1