Reaction Details
TargetMu-type opioid receptor
LigandBDBM50212619
Substrate/Competitorn/a
Meas. Tech.ChEMBL_436682 (CHEMBL904991)
Ki 0.092±n/a nM
Citation Li, TShiotani, KMiyazaki, ATsuda, YAmbo, ASasaki, YJinsmaa, YMarczak, EBryant, SDLazarus, LHOkada, Y Bifunctional [2',6'-dimethyl-L-tyrosine1]endomorphin-2 analogues substituted at position 3 with alkylated phenylalanine derivatives yield potent mixed mu-agonist/delta-antagonist and dual mu-agonist/delta-agonist opioid ligands. J Med Chem50:2753-66 (2007) 
 
Mu-type opioid receptor
Name:Mu-type opioid receptor
Type:G Protein-Coupled Receptor (GPCR)
Mol. Mass.:44503.11
Organism:Rattus norvegicus (rat)
Description:Competition binding assays were carried out using membrane preparations from transfected HN9.10 cells that constitutively expressed the mu opioid receptor.
Residue:398
BDBM50212619
NameBDBM50212619
Synonyms:CHEMBL388800 | Dmt-Pro-Dmt-Phe-NH2
TypeSmall organic molecule
Emp. Form.C35H43N5O6
Mol. Mass.629.7458
SMILESCc1cc(O)ccc1C[C@H](NC(=O)[C@@H]1CCCN1C(=O)[C@@H](N)Cc1c(C)cc(O)cc1C)C(=O)N[C@@H](Cc1ccccc1)C(N)=O